Reaction Details
TargetEphrin type-B receptor 4
LigandBDBM50312191
Substrate/Competitorn/a
Meas. Tech.ChEMBL_621633 (CHEMBL1115704)
IC50 10500±n/a nM
Citation Mitchell, SADanca, MDBlomgren, PADarrow, JWCurrie, KSKropf, JELee, SHGallion, SLXiong, JMPippin, DADeSimone, RWBrittelli, DREustice, DCBourret, AHill-Drzewi, MMaciejewski, PMElkin, LL Imidazo[1,2-a]pyrazine diaryl ureas: inhibitors of the receptor tyrosine kinase EphB4. Bioorg Med Chem Lett19:6991-5 (2009) 
 
Ephrin type-B receptor 4
Name:Ephrin type-B receptor 4
Type:Enzyme
Mol. Mass.:108273.51
Organism:Homo sapiens (Human)
Description:P54760
Residue:987
BDBM50312191
NameBDBM50312191
Synonyms:1-(3-phenoxyphenyl)-3-(3-(8-(pyridin-4-ylmethylamino)imidazo[1,2-a]pyrazin-6-yl)phenyl)urea | CHEMBL1080669
TypeSmall organic molecule
Emp. Form.C31H25N7O2
Mol. Mass.527.5759
SMILESO=C(Nc1cccc(Oc2ccccc2)c1)Nc1cccc(c1)-c1cn2ccnc2c(NCc2ccncc2)n1