Reaction Details
TargetLow molecular weight protein-tyrosine phosphatase A
LigandBDBM50312247
Substrate/Competitorn/a
Meas. Tech.ChEMBL_621991 (CHEMBL1106782)
Ki 54800±n/a nM
Citation Rawls, KALang, PTTakeuchi, JImamura, SBaguley, TDGrundner, CAlber, TEllman, JA Fragment-based discovery of selective inhibitors of the Mycobacterium tuberculosis protein tyrosine phosphatase PtpA. Bioorg Med Chem Lett19:6851-4 (2009) 
 
Low molecular weight protein-tyrosine phosphatase A
Name:Low molecular weight protein-tyrosine phosphatase A
Type:Hydrolase
Mol. Mass.:17891.84
Organism:Mycobacterium tuberculosis
Description:n/a
Residue:163
BDBM50312247
NameBDBM50312247
Synonyms:CHEMBL1075838 | difluoro(4-(2-(trifluoromethyl)phenylcarbamoyl)phenyl)methylphosphonic acid
TypeSmall organic molecule
Emp. Form.C15H11F5NO4P
Mol. Mass.395.2179
SMILESOP(O)(=O)C(F)(F)c1ccc(cc1)C(=O)Nc1ccccc1C(F)(F)F