Reaction Details
TargetLow molecular weight protein-tyrosine phosphatase A
LigandBDBM50312259
Substrate/Competitorn/a
Meas. Tech.ChEMBL_621991 (CHEMBL1106782)
Ki 4900±n/a nM
Citation Rawls, KALang, PTTakeuchi, JImamura, SBaguley, TDGrundner, CAlber, TEllman, JA Fragment-based discovery of selective inhibitors of the Mycobacterium tuberculosis protein tyrosine phosphatase PtpA. Bioorg Med Chem Lett19:6851-4 (2009) 
 
Low molecular weight protein-tyrosine phosphatase A
Name:Low molecular weight protein-tyrosine phosphatase A
Type:Hydrolase
Mol. Mass.:17891.84
Organism:Mycobacterium tuberculosis
Description:n/a
Residue:163
BDBM50312259
NameBDBM50312259
Synonyms:(4-(4-bromo-3-(trifluoromethyl)phenylcarbamoyl)phenyl)difluoromethylphosphonic acid | CHEMBL1079479
TypeSmall organic molecule
Emp. Form.C15H10BrF5NO4P
Mol. Mass.474.114
SMILESOP(O)(=O)C(F)(F)c1ccc(cc1)C(=O)Nc1ccc(Br)c(c1)C(F)(F)F