Reaction Details
TargetPeroxisome proliferator-activated receptor gamma
LigandBDBM50312420
Substrate/Competitorn/a
Meas. Tech.ChEMBL_620647 (CHEMBL1114855)
EC50 1200±n/a nM
Citation Epple, RCow, CXie, YAzimioara, MRusso, RWang, XWityak, JKaranewsky, DSTuntland, TNguyêñ-Trân, VTCuc Ngo, CHuang, DSaez, ESpalding, TGerken, AIskandar, MSeidel, HMTian, SS Novel bisaryl substituted thiazoles and oxazoles as highly potent and selective peroxisome proliferator-activated receptor delta agonists. J Med Chem53:77-105 (2010) 
 
Peroxisome proliferator-activated receptor gamma
Name:Peroxisome proliferator-activated receptor gamma
Type:Nuclear Receptor
Mol. Mass.:57613.46
Organism:Homo sapiens (Human)
Description:P37231
Residue:505
BDBM50312420
NameBDBM50312420
Synonyms:2-(4-((4-(4-(N-Isopropyl-N-methyl)benzamide)-5-(4-(trifluoromethoxy)phenyl)thiazol-2-yl)methoxy)-2-methylphenoxy)acetic Acid | CHEMBL1075723
TypeSmall organic molecule
Emp. Form.C31H29F3N2O6S
Mol. Mass.614.632
SMILESCC(C)N(C)C(=O)c1ccc(cc1)-c1nc(COc2ccc(OCC(O)=O)c(C)c2)sc1-c1ccc(OC(F)(F)F)cc1