Reaction Details
TargetPeroxisome proliferator-activated receptor alpha
LigandBDBM50312453
Substrate/Competitorn/a
Meas. Tech.ChEMBL_620646 (CHEMBL1114854)
EC50>10000±n/a nM
Citation Epple, RCow, CXie, YAzimioara, MRusso, RWang, XWityak, JKaranewsky, DSTuntland, TNguyêñ-Trân, VTCuc Ngo, CHuang, DSaez, ESpalding, TGerken, AIskandar, MSeidel, HMTian, SS Novel bisaryl substituted thiazoles and oxazoles as highly potent and selective peroxisome proliferator-activated receptor delta agonists. J Med Chem53:77-105 (2010) 
 
Peroxisome proliferator-activated receptor alpha
Name:Peroxisome proliferator-activated receptor alpha
Type:Enzyme
Mol. Mass.:52222.08
Organism:Homo sapiens (Human)
Description:Q07869
Residue:468
BDBM50312453
NameBDBM50312453
Synonyms:2-(4-(4,5-Bis(4-methoxyphenyl)thiazol-2-ylthio)-3-chlorophenyl)acetic Acid | CHEMBL1081044
TypeSmall organic molecule
Emp. Form.C25H20ClNO5S2
Mol. Mass.514.013
SMILESCOc1ccc(cc1)-c1nc(Sc2ccc(OCC(O)=O)cc2Cl)sc1-c1ccc(OC)cc1