Reaction Details
TargetPeroxisome proliferator-activated receptor alpha
LigandBDBM50312464
Substrate/Competitorn/a
Meas. Tech.ChEMBL_620646 (CHEMBL1114854)
EC50>10000±n/a nM
Citation Epple, RCow, CXie, YAzimioara, MRusso, RWang, XWityak, JKaranewsky, DSTuntland, TNguyêñ-Trân, VTCuc Ngo, CHuang, DSaez, ESpalding, TGerken, AIskandar, MSeidel, HMTian, SS Novel bisaryl substituted thiazoles and oxazoles as highly potent and selective peroxisome proliferator-activated receptor delta agonists. J Med Chem53:77-105 (2010) 
 
Peroxisome proliferator-activated receptor alpha
Name:Peroxisome proliferator-activated receptor alpha
Type:Enzyme
Mol. Mass.:52222.08
Organism:Homo sapiens (Human)
Description:Q07869
Residue:468
BDBM50312464
NameBDBM50312464
Synonyms:2-(4-(3-(4-bromophenyl)-5-(4-(trifluoromethyl)phenyl)pent-2-en-4-ynyloxy)-2-methylphenoxy)acetic acid | CHEMBL1081963
TypeSmall organic molecule
Emp. Form.C27H20BrF3O4
Mol. Mass.545.345
SMILESCc1cc(OC\C=C(/C#Cc2ccc(cc2)C(F)(F)F)c2ccc(Br)cc2)ccc1OCC(O)=O