Reaction Details
TargetPeroxisome proliferator-activated receptor delta
LigandBDBM50312472
Substrate/Competitorn/a
Meas. Tech.ChEMBL_620648 (CHEMBL1114856)
EC50 8±n/a nM
Citation Epple, RCow, CXie, YAzimioara, MRusso, RWang, XWityak, JKaranewsky, DSTuntland, TNguyêñ-Trân, VTCuc Ngo, CHuang, DSaez, ESpalding, TGerken, AIskandar, MSeidel, HMTian, SS Novel bisaryl substituted thiazoles and oxazoles as highly potent and selective peroxisome proliferator-activated receptor delta agonists. J Med Chem53:77-105 (2010) 
 
Peroxisome proliferator-activated receptor delta
Name:Peroxisome proliferator-activated receptor delta
Type:Enzyme
Mol. Mass.:49910.45
Organism:Homo sapiens (Human)
Description:Q03181
Residue:441
BDBM50312472
NameBDBM50312472
Synonyms:2-(4-((5-(4-Biphenyl)-4-(pyridin-3-yl)oxazol-2-yl)methoxy)-2-methylphenoxy)acetic Acid | CHEMBL1079752
TypeSmall organic molecule
Emp. Form.C30H24N2O5
Mol. Mass.492.522
SMILESCc1cc(OCc2nc(c(o2)-c2ccc(cc2)-c2ccccc2)-c2cccnc2)ccc1OCC(O)=O