Reaction Details
TargetPeroxisome proliferator-activated receptor delta
LigandBDBM50312386
Substrate/Competitorn/a
Meas. Tech.ChEMBL_620648 (CHEMBL1114856)
EC50 510±n/a nM
Citation Epple, RCow, CXie, YAzimioara, MRusso, RWang, XWityak, JKaranewsky, DSTuntland, TNguyêñ-Trân, VTCuc Ngo, CHuang, DSaez, ESpalding, TGerken, AIskandar, MSeidel, HMTian, SS Novel bisaryl substituted thiazoles and oxazoles as highly potent and selective peroxisome proliferator-activated receptor delta agonists. J Med Chem53:77-105 (2010) 
 
Peroxisome proliferator-activated receptor delta
Name:Peroxisome proliferator-activated receptor delta
Type:Enzyme
Mol. Mass.:49910.45
Organism:Homo sapiens (Human)
Description:Q03181
Residue:441
BDBM50312386
NameBDBM50312386
Synonyms:2-(4-((4,5-bis(4-chlorophenyl)thiazol-2-yl)methoxy)-2-methylphenoxy)acetic acid | CHEMBL1080026
TypeSmall organic molecule
Emp. Form.C25H19Cl2NO4S
Mol. Mass.500.394
SMILESCc1cc(OCc2nc(c(s2)-c2ccc(Cl)cc2)-c2ccc(Cl)cc2)ccc1OCC(O)=O