Reaction Details
TargetPeroxisome proliferator-activated receptor delta
LigandBDBM50312471
Substrate/Competitorn/a
Meas. Tech.ChEMBL_620652 (CHEMBL1115673)
EC50 14±n/a nM
Citation Epple, RCow, CXie, YAzimioara, MRusso, RWang, XWityak, JKaranewsky, DSTuntland, TNguyêñ-Trân, VTCuc Ngo, CHuang, DSaez, ESpalding, TGerken, AIskandar, MSeidel, HMTian, SS Novel bisaryl substituted thiazoles and oxazoles as highly potent and selective peroxisome proliferator-activated receptor delta agonists. J Med Chem53:77-105 (2010) 
 
Peroxisome proliferator-activated receptor delta
Name:Peroxisome proliferator-activated receptor delta
Type:Enzyme
Mol. Mass.:49910.45
Organism:Homo sapiens (Human)
Description:Q03181
Residue:441
BDBM50312471
NameBDBM50312471
Synonyms:2-(4-((4-(4-Morpholinophenyl)-5-(4-biphenyl)thiazol-2-yl)-methoxy)-2-methylphenoxy)acetic Acid | CHEMBL1076163
TypeSmall organic molecule
Emp. Form.C35H32N2O5S
Mol. Mass.592.704
SMILESCc1cc(OCc2nc(c(s2)-c2ccc(cc2)-c2ccccc2)-c2ccc(cc2)N2CCOCC2)ccc1OCC(O)=O