Reaction Details
TargetPeroxisome proliferator-activated receptor delta
LigandBDBM50312467
Substrate/Competitorn/a
Meas. Tech.ChEMBL_620652 (CHEMBL1115673)
EC50 16±n/a nM
Citation Epple, RCow, CXie, YAzimioara, MRusso, RWang, XWityak, JKaranewsky, DSTuntland, TNguyêñ-Trân, VTCuc Ngo, CHuang, DSaez, ESpalding, TGerken, AIskandar, MSeidel, HMTian, SS Novel bisaryl substituted thiazoles and oxazoles as highly potent and selective peroxisome proliferator-activated receptor delta agonists. J Med Chem53:77-105 (2010) 
 
Peroxisome proliferator-activated receptor delta
Name:Peroxisome proliferator-activated receptor delta
Type:Enzyme
Mol. Mass.:49910.45
Organism:Homo sapiens (Human)
Description:Q03181
Residue:441
BDBM50312467
NameBDBM50312467
Synonyms:2-(4-((5-(4-(Trifluoromethyl)phenyl)-4-(4-isopropoxyphenyl)-thiazol-2-yl)methoxy)-2-methylphenoxy)acetic Acid | CHEMBL1081546
TypeSmall organic molecule
Emp. Form.C29H26F3NO5S
Mol. Mass.557.581
SMILESCC(C)Oc1ccc(cc1)-c1nc(COc2ccc(OCC(O)=O)c(C)c2)sc1-c1ccc(cc1)C(F)(F)F