Reaction Details
TargetLactase/phlorizin hydrolase
LigandBDBM50163440
Substrate/Competitorn/a
Meas. Tech.ChEMBL_617532 (CHEMBL1099882)
IC50 50000±n/a nM
Citation Wennekes, TMeijer, AJGroen, AKBoot, RGGroener, JEvan Eijk, MOttenhoff, RBijl, NGhauharali, KSong, HO'Shea, TJLiu, HYew, NCopeland, Dvan den Berg, RJvan der Marel, GAOverkleeft, HSAerts, JM Dual-action lipophilic iminosugar improves glycemic control in obese rodents by reduction of visceral glycosphingolipids and buffering of carbohydrate assimilation. J Med Chem53:689-98 (2010) 
 
Lactase/phlorizin hydrolase
Name:Lactase/phlorizin hydrolase
Type:PROTEIN
Mol. Mass.:218576.40
Organism:Homo sapiens (Human)
Description:ChEMBL_1435478
Residue:1927
BDBM50163440
NameBDBM50163440
Synonyms:(2R,3S,4R,5S)-2-(hydroxymethyl)piperidine-3,4,5-triol 1-deoxygalactonojirimycin D-galacto-1-Deoxynojirimycin | DGJ
TypeSmall organic molecule
Emp. Form.C6H13NO4
Mol. Mass.163.1717
SMILESOC[C@H]1NC[C@H](O)[C@@H](O)[C@H]1O