Reaction Details
TargetCannabinoid receptor 1
LigandBDBM50312586
Substrate/Competitorn/a
Meas. Tech.ChEMBL_615551 (CHEMBL1107820)
Ki 1.8±n/a nM
Citation Meng, TWang, JPeng, HFang, GLi, MXiong, BXie, XZhang, YWang, XShen, J Discovery of benzhydrylpiperazine derivatives as CB1 receptor inverse agonists via privileged structure-based approach. Eur J Med Chem45:1133-9 (2010) 
 
Cannabinoid receptor 1
Name:Cannabinoid receptor 1
Type:G Protein-Coupled Receptor (GPCR)
Mol. Mass.:52868.96
Organism:Homo sapiens (Human)
Description:P21554
Residue:472
BDBM50312586
NameBDBM50312586
Synonyms:4-[(4-bromo-2-fluorophenyl)(phenyl)methyl]-N-cyclohexylpiperazine-1-carboxamide | CHEMBL1087251
TypeSmall organic molecule
Emp. Form.C24H29BrFN3O
Mol. Mass.474.409
SMILESFc1cc(Br)ccc1C(N1CCN(CC1)C(=O)NC1CCCCC1)c1ccccc1