Reaction Details
TargetCannabinoid receptor 1
LigandBDBM50312587
Substrate/Competitorn/a
Meas. Tech.ChEMBL_615551 (CHEMBL1107820)
Ki 8.1±n/a nM
Citation Meng, TWang, JPeng, HFang, GLi, MXiong, BXie, XZhang, YWang, XShen, J Discovery of benzhydrylpiperazine derivatives as CB1 receptor inverse agonists via privileged structure-based approach. Eur J Med Chem45:1133-9 (2010) 
 
Cannabinoid receptor 1
Name:Cannabinoid receptor 1
Type:G Protein-Coupled Receptor (GPCR)
Mol. Mass.:52868.96
Organism:Homo sapiens (Human)
Description:P21554
Residue:472
BDBM50312587
NameBDBM50312587
Synonyms:4-[(2-chloro-4-fluorophenyl)(phenyl)methyl]-N-cyclohexylpiperazine-1-carboxamide | CHEMBL1086605
TypeSmall organic molecule
Emp. Form.C24H29ClFN3O
Mol. Mass.429.958
SMILESFc1ccc(C(N2CCN(CC2)C(=O)NC2CCCCC2)c2ccccc2)c(Cl)c1