Reaction Details
TargetCannabinoid receptor 1
LigandBDBM50312597
Substrate/Competitorn/a
Meas. Tech.ChEMBL_615551 (CHEMBL1107820)
Ki 0.2±n/a nM
Citation Meng, TWang, JPeng, HFang, GLi, MXiong, BXie, XZhang, YWang, XShen, J Discovery of benzhydrylpiperazine derivatives as CB1 receptor inverse agonists via privileged structure-based approach. Eur J Med Chem45:1133-9 (2010) 
 
Cannabinoid receptor 1
Name:Cannabinoid receptor 1
Type:G Protein-Coupled Receptor (GPCR)
Mol. Mass.:52868.96
Organism:Homo sapiens (Human)
Description:P21554
Residue:472
BDBM50312597
NameBDBM50312597
Synonyms:CHEMBL1093377 | N-Cyclohexyl-4-[(2,4-dichlorophenyl)(phenyl)methyl]-piperazine-1-carbothioamide
TypeSmall organic molecule
Emp. Form.C24H29Cl2N3S
Mol. Mass.462.478
SMILESClc1ccc(C(N2CCN(CC2)C(=S)NC2CCCCC2)c2ccccc2)c(Cl)c1