Reaction Details
TargetCannabinoid receptor 2
LigandBDBM50312578
Substrate/Competitorn/a
Meas. Tech.ChEMBL_615552 (CHEMBL1107821)
Ki 3050±n/a nM
Citation Meng, TWang, JPeng, HFang, GLi, MXiong, BXie, XZhang, YWang, XShen, J Discovery of benzhydrylpiperazine derivatives as CB1 receptor inverse agonists via privileged structure-based approach. Eur J Med Chem45:1133-9 (2010) 
 
Cannabinoid receptor 2
Name:Cannabinoid receptor 2
Type:G Protein-Coupled Receptor (GPCR)
Mol. Mass.:39690.94
Organism:Homo sapiens (Human)
Description:P34972
Residue:360
BDBM50312578
NameBDBM50312578
Synonyms:(4-benzhydrylpiperazin-1-yl)(cyclohexyl)methanone | CHEMBL1088730
TypeSmall organic molecule
Emp. Form.C24H30N2O
Mol. Mass.362.5078
SMILESO=C(C1CCCCC1)N1CCN(CC1)C(c1ccccc1)c1ccccc1