Reaction Details
TargetCannabinoid receptor 2
LigandBDBM50312587
Substrate/Competitorn/a
Meas. Tech.ChEMBL_615552 (CHEMBL1107821)
Ki 1300±n/a nM
Citation Meng, TWang, JPeng, HFang, GLi, MXiong, BXie, XZhang, YWang, XShen, J Discovery of benzhydrylpiperazine derivatives as CB1 receptor inverse agonists via privileged structure-based approach. Eur J Med Chem45:1133-9 (2010) 
 
Cannabinoid receptor 2
Name:Cannabinoid receptor 2
Type:G Protein-Coupled Receptor (GPCR)
Mol. Mass.:39690.94
Organism:Homo sapiens (Human)
Description:P34972
Residue:360
BDBM50312587
NameBDBM50312587
Synonyms:4-[(2-chloro-4-fluorophenyl)(phenyl)methyl]-N-cyclohexylpiperazine-1-carboxamide | CHEMBL1086605
TypeSmall organic molecule
Emp. Form.C24H29ClFN3O
Mol. Mass.429.958
SMILESFc1ccc(C(N2CCN(CC2)C(=O)NC2CCCCC2)c2ccccc2)c(Cl)c1