Reaction Details
TargetCannabinoid receptor 2
LigandBDBM50312588
Substrate/Competitorn/a
Meas. Tech.ChEMBL_615552 (CHEMBL1107821)
Ki 526±n/a nM
Citation Meng, TWang, JPeng, HFang, GLi, MXiong, BXie, XZhang, YWang, XShen, J Discovery of benzhydrylpiperazine derivatives as CB1 receptor inverse agonists via privileged structure-based approach. Eur J Med Chem45:1133-9 (2010) 
 
Cannabinoid receptor 2
Name:Cannabinoid receptor 2
Type:G Protein-Coupled Receptor (GPCR)
Mol. Mass.:39690.94
Organism:Homo sapiens (Human)
Description:P34972
Residue:360
BDBM50312588
NameBDBM50312588
Synonyms:4-[(2-fluoro-4-chlorophenyl)(phenyl)methyl]-N-cyclohexylpiperazine-1-carboxamide | CHEMBL1088161
TypeSmall organic molecule
Emp. Form.C24H29ClFN3O
Mol. Mass.429.958
SMILESFc1cc(Cl)ccc1C(N1CCN(CC1)C(=O)NC1CCCCC1)c1ccccc1