Reaction Details
TargetCannabinoid receptor 1
LigandBDBM50312582
Substrate/Competitorn/a
Meas. Tech.ChEMBL_615553 (CHEMBL1107822)
IC50 9.2±n/a nM
Citation Meng, TWang, JPeng, HFang, GLi, MXiong, BXie, XZhang, YWang, XShen, J Discovery of benzhydrylpiperazine derivatives as CB1 receptor inverse agonists via privileged structure-based approach. Eur J Med Chem45:1133-9 (2010) 
 
Cannabinoid receptor 1
Name:Cannabinoid receptor 1
Type:G Protein-Coupled Receptor (GPCR)
Mol. Mass.:52868.96
Organism:Homo sapiens (Human)
Description:P21554
Residue:472
BDBM50312582
NameBDBM50312582
Synonyms:CHEMBL1088728 | N-Cyclohexyl-4-[(2,4-dichlorophenyl)(phenyl)methyl]-piperazine-1-carboxamide
TypeSmall organic molecule
Emp. Form.C24H29Cl2N3O
Mol. Mass.446.413
SMILESClc1ccc(C(N2CCN(CC2)C(=O)NC2CCCCC2)c2ccccc2)c(Cl)c1