Reaction Details
TargetCannabinoid receptor 1
LigandBDBM50312588
Substrate/Competitorn/a
Meas. Tech.ChEMBL_615553 (CHEMBL1107822)
IC50 124±n/a nM
Citation Meng, TWang, JPeng, HFang, GLi, MXiong, BXie, XZhang, YWang, XShen, J Discovery of benzhydrylpiperazine derivatives as CB1 receptor inverse agonists via privileged structure-based approach. Eur J Med Chem45:1133-9 (2010) 
 
Cannabinoid receptor 1
Name:Cannabinoid receptor 1
Type:G Protein-Coupled Receptor (GPCR)
Mol. Mass.:52868.96
Organism:Homo sapiens (Human)
Description:P21554
Residue:472
BDBM50312588
NameBDBM50312588
Synonyms:4-[(2-fluoro-4-chlorophenyl)(phenyl)methyl]-N-cyclohexylpiperazine-1-carboxamide | CHEMBL1088161
TypeSmall organic molecule
Emp. Form.C24H29ClFN3O
Mol. Mass.429.958
SMILESFc1cc(Cl)ccc1C(N1CCN(CC1)C(=O)NC1CCCCC1)c1ccccc1