Reaction Details
TargetCannabinoid receptor 1
LigandBDBM50312589
Substrate/Competitorn/a
Meas. Tech.ChEMBL_615553 (CHEMBL1107822)
IC50>10000±n/a nM
Citation Meng, TWang, JPeng, HFang, GLi, MXiong, BXie, XZhang, YWang, XShen, J Discovery of benzhydrylpiperazine derivatives as CB1 receptor inverse agonists via privileged structure-based approach. Eur J Med Chem45:1133-9 (2010) 
 
Cannabinoid receptor 1
Name:Cannabinoid receptor 1
Type:G Protein-Coupled Receptor (GPCR)
Mol. Mass.:52868.96
Organism:Homo sapiens (Human)
Description:P21554
Residue:472
BDBM50312589
NameBDBM50312589
Synonyms:1-(cyclobutylcarbonyl)-4-[(2,4-dichlorophenyl)(phenyl)methyl]piperazine | CHEMBL1076884
TypeSmall organic molecule
Emp. Form.C22H24Cl2N2O
Mol. Mass.403.345
SMILESClc1ccc(C(N2CCN(CC2)C(=O)C2CCC2)c2ccccc2)c(Cl)c1