Reaction Details
TargetCannabinoid receptor 1
LigandBDBM50312593
Substrate/Competitorn/a
Meas. Tech.ChEMBL_615553 (CHEMBL1107822)
IC50>10000±n/a nM
Citation Meng, TWang, JPeng, HFang, GLi, MXiong, BXie, XZhang, YWang, XShen, J Discovery of benzhydrylpiperazine derivatives as CB1 receptor inverse agonists via privileged structure-based approach. Eur J Med Chem45:1133-9 (2010) 
 
Cannabinoid receptor 1
Name:Cannabinoid receptor 1
Type:G Protein-Coupled Receptor (GPCR)
Mol. Mass.:52868.96
Organism:Homo sapiens (Human)
Description:P21554
Residue:472
BDBM50312593
NameBDBM50312593
Synonyms:1-[(2,4-dichlorophenyl)(phenyl)methyl]-4-(piperidin-1-ylcarbonyl)piperazine | CHEMBL1089716
TypeSmall organic molecule
Emp. Form.C23H27Cl2N3O
Mol. Mass.432.386
SMILESClc1ccc(C(N2CCN(CC2)C(=O)N2CCCCC2)c2ccccc2)c(Cl)c1