Reaction Details
TargetCannabinoid receptor 1
LigandBDBM50312602
Substrate/Competitorn/a
Meas. Tech.ChEMBL_615551 (CHEMBL1107820)
Ki 1.1±n/a nM
Citation Meng, TWang, JPeng, HFang, GLi, MXiong, BXie, XZhang, YWang, XShen, J Discovery of benzhydrylpiperazine derivatives as CB1 receptor inverse agonists via privileged structure-based approach. Eur J Med Chem45:1133-9 (2010) 
 
Cannabinoid receptor 1
Name:Cannabinoid receptor 1
Type:G Protein-Coupled Receptor (GPCR)
Mol. Mass.:52868.96
Organism:Homo sapiens (Human)
Description:P21554
Residue:472
BDBM50312602
NameBDBM50312602
Synonyms:CHEMBL1091814 | N-cyclohexyl-4-[(2,4-dichlorophenyl)(4-phenoxyphenyl)methyl]piperazine-1-carboxamide
TypeSmall organic molecule
Emp. Form.C30H33Cl2N3O2
Mol. Mass.538.508
SMILESClc1ccc(C(N2CCN(CC2)C(=O)NC2CCCCC2)c2ccc(Oc3ccccc3)cc2)c(Cl)c1