Reaction Details
TargetCannabinoid receptor 2
LigandBDBM50312600
Substrate/Competitorn/a
Meas. Tech.ChEMBL_615552 (CHEMBL1107821)
Ki 317±n/a nM
Citation Meng, TWang, JPeng, HFang, GLi, MXiong, BXie, XZhang, YWang, XShen, J Discovery of benzhydrylpiperazine derivatives as CB1 receptor inverse agonists via privileged structure-based approach. Eur J Med Chem45:1133-9 (2010) 
 
Cannabinoid receptor 2
Name:Cannabinoid receptor 2
Type:G Protein-Coupled Receptor (GPCR)
Mol. Mass.:39690.94
Organism:Homo sapiens (Human)
Description:P34972
Residue:360
BDBM50312600
NameBDBM50312600
Synonyms:4-[(2,4-Dichlorophenyl)(p-tolyl)methyl]-N-piperidin-1-ylpiperazine-1-carboxamide | CHEMBL1091812
TypeSmall organic molecule
Emp. Form.C24H30Cl2N4O
Mol. Mass.461.427
SMILESCc1ccc(cc1)C(N1CCN(CC1)C(=O)NN1CCCCC1)c1ccc(Cl)cc1Cl