Reaction Details
TargetCannabinoid receptor 2
LigandBDBM50312601
Substrate/Competitorn/a
Meas. Tech.ChEMBL_615552 (CHEMBL1107821)
Ki 290±n/a nM
Citation Meng, TWang, JPeng, HFang, GLi, MXiong, BXie, XZhang, YWang, XShen, J Discovery of benzhydrylpiperazine derivatives as CB1 receptor inverse agonists via privileged structure-based approach. Eur J Med Chem45:1133-9 (2010) 
 
Cannabinoid receptor 2
Name:Cannabinoid receptor 2
Type:G Protein-Coupled Receptor (GPCR)
Mol. Mass.:39690.94
Organism:Homo sapiens (Human)
Description:P34972
Residue:360
BDBM50312601
NameBDBM50312601
Synonyms:CHEMBL1091813 | N-cyclohexyl-4-[(2,4-dichlorophenyl)(4-methoxyphenyl)methyl]piperazine-1-carboxamide
TypeSmall organic molecule
Emp. Form.C25H31Cl2N3O2
Mol. Mass.476.439
SMILESCOc1ccc(cc1)C(N1CCN(CC1)C(=O)NC1CCCCC1)c1ccc(Cl)cc1Cl