Reaction Details
TargetCannabinoid receptor 1
LigandBDBM50242582
Substrate/Competitorn/a
Meas. Tech.ChEMBL_615553 (CHEMBL1107822)
IC50 19±n/a nM
Citation Meng, TWang, JPeng, HFang, GLi, MXiong, BXie, XZhang, YWang, XShen, J Discovery of benzhydrylpiperazine derivatives as CB1 receptor inverse agonists via privileged structure-based approach. Eur J Med Chem45:1133-9 (2010) 
 
Cannabinoid receptor 1
Name:Cannabinoid receptor 1
Type:G Protein-Coupled Receptor (GPCR)
Mol. Mass.:52868.96
Organism:Homo sapiens (Human)
Description:P21554
Residue:472
BDBM50242582
NameBDBM50242582
Synonyms:4-((4-Chlorophenyl)(2,4-dichlorophenyl)methyl)-N-cyclohexylpiperazine-1-carboxamide CHEMBL529436
TypeSmall organic molecule
Emp. Form.C24H28Cl3N3O
Mol. Mass.480.858
SMILESClc1ccc(cc1)C(N1CCN(CC1)C(=O)NC1CCCCC1)c1ccc(Cl)cc1Cl