Reaction Details
TargetCannabinoid receptor 1
LigandBDBM50312599
Substrate/Competitorn/a
Meas. Tech.ChEMBL_615553 (CHEMBL1107822)
IC50 2.7±n/a nM
Citation Meng, TWang, JPeng, HFang, GLi, MXiong, BXie, XZhang, YWang, XShen, J Discovery of benzhydrylpiperazine derivatives as CB1 receptor inverse agonists via privileged structure-based approach. Eur J Med Chem45:1133-9 (2010) 
 
Cannabinoid receptor 1
Name:Cannabinoid receptor 1
Type:G Protein-Coupled Receptor (GPCR)
Mol. Mass.:52868.96
Organism:Homo sapiens (Human)
Description:P21554
Residue:472
BDBM50312599
NameBDBM50312599
Synonyms:CHEMBL1093735 | N-Cyclohexyl-4-[(2,4-dichlorophenyl)(p-tolyl)methyl]piperazine-1-carboxamide
TypeSmall organic molecule
Emp. Form.C25H31Cl2N3O
Mol. Mass.460.439
SMILESCc1ccc(cc1)C(N1CCN(CC1)C(=O)NC1CCCCC1)c1ccc(Cl)cc1Cl