Reaction Details
TargetPhosphatidylinositol 4,5-bisphosphate 3-kinase catalytic subunit beta isoform
LigandBDBM50312605
Substrate/Competitorn/a
Meas. Tech.ChEMBL_615564 (CHEMBL1108626)
IC50 25±n/a nM
Citation Sutherlin, DPSampath, DBerry, MCastanedo, GChang, ZChuckowree, IDotson, JFolkes, AFriedman, LGoldsmith, RHeffron, TLee, LLesnick, JLewis, CMathieu, SNonomiya, JOlivero, APang, JPrior, WWSalphati, LSideris, STian, QTsui, VWan, NCWang, SWiesmann, CWong, SZhu, BY Discovery of (thienopyrimidin-2-yl)aminopyrimidines as potent, selective, and orally available pan-PI3-kinase and dual pan-PI3-kinase/mTOR inhibitors for the treatment of cancer. J Med Chem53:1086-97 (2010) 
 
Phosphatidylinositol 4,5-bisphosphate 3-kinase catalytic subunit beta isoform
Name:Phosphatidylinositol 4,5-bisphosphate 3-kinase catalytic subunit beta isoform
Type:Enzyme Subunit
Mol. Mass.:122769.00
Organism:Homo sapiens (Human)
Description:P42338
Residue:1070
BDBM50312605
NameBDBM50312605
Synonyms:2-(2-(2-amino-4-methylpyrimidin-5-yl)-4-morpholinothieno[3,2-d]pyrimidin-6-yl)propan-2-ol | CHEMBL1085178
TypeSmall organic molecule
Emp. Form.C18H22N6O2S
Mol. Mass.386.471
SMILESCc1nc(N)ncc1-c1nc(N2CCOCC2)c2sc(cc2n1)C(C)(C)O