Reaction Details
TargetPhosphatidylinositol 4,5-bisphosphate 3-kinase catalytic subunit delta isoform
LigandBDBM50312610
Substrate/Competitorn/a
Meas. Tech.ChEMBL_615565 (CHEMBL1108627)
IC50 310±n/a nM
Citation Sutherlin, DPSampath, DBerry, MCastanedo, GChang, ZChuckowree, IDotson, JFolkes, AFriedman, LGoldsmith, RHeffron, TLee, LLesnick, JLewis, CMathieu, SNonomiya, JOlivero, APang, JPrior, WWSalphati, LSideris, STian, QTsui, VWan, NCWang, SWiesmann, CWong, SZhu, BY Discovery of (thienopyrimidin-2-yl)aminopyrimidines as potent, selective, and orally available pan-PI3-kinase and dual pan-PI3-kinase/mTOR inhibitors for the treatment of cancer. J Med Chem53:1086-97 (2010) 
 
Phosphatidylinositol 4,5-bisphosphate 3-kinase catalytic subunit delta isoform
Name:Phosphatidylinositol 4,5-bisphosphate 3-kinase catalytic subunit delta isoform
Type:Enzyme Subunit
Mol. Mass.:119489.41
Organism:Homo sapiens (Human)
Description:O00329
Residue:1044
BDBM50312610
NameBDBM50312610
Synonyms:6-(4-Methanesulfonyl-piperazin-1-ylmethyl)-4-morpholin-4-yl-2-pyridin-4-yl-thieno[3,2-d]pyrimidine | CHEMBL1077023
TypeSmall organic molecule
Emp. Form.C21H26N6O3S2
Mol. Mass.474.6
SMILESCS(=O)(=O)N1CCN(Cc2cc3nc(nc(N4CCOCC4)c3s2)-c2ccncc2)CC1