Reaction Details
TargetPhosphatidylinositol 4,5-bisphosphate 3-kinase catalytic subunit beta isoform
LigandBDBM50312609
Substrate/Competitorn/a
Meas. Tech.ChEMBL_615564 (CHEMBL1108626)
IC50 14±n/a nM
Citation Sutherlin, DPSampath, DBerry, MCastanedo, GChang, ZChuckowree, IDotson, JFolkes, AFriedman, LGoldsmith, RHeffron, TLee, LLesnick, JLewis, CMathieu, SNonomiya, JOlivero, APang, JPrior, WWSalphati, LSideris, STian, QTsui, VWan, NCWang, SWiesmann, CWong, SZhu, BY Discovery of (thienopyrimidin-2-yl)aminopyrimidines as potent, selective, and orally available pan-PI3-kinase and dual pan-PI3-kinase/mTOR inhibitors for the treatment of cancer. J Med Chem53:1086-97 (2010) 
 
Phosphatidylinositol 4,5-bisphosphate 3-kinase catalytic subunit beta isoform
Name:Phosphatidylinositol 4,5-bisphosphate 3-kinase catalytic subunit beta isoform
Type:Enzyme Subunit
Mol. Mass.:122769.00
Organism:Homo sapiens (Human)
Description:P42338
Residue:1070
BDBM50312609
NameBDBM50312609
Synonyms:(3-(6-((4-(Methylsulfonyl)piperazin-1-yl)methyl)-4-morpholinothieno[3,2-d]pyrimidin-2-yl)phenyl)methanol [3-(6-{[4-(methylsulfonyl)piperazin-1-yl]methyl}-4-morpholin-4-ylthieno[3,2-d]pyrimidin-2-yl)phenyl]methanol
TypeSmall organic molecule
Emp. Form.C23H29N5O4S2
Mol. Mass.503.637
SMILESCS(=O)(=O)N1CCN(Cc2cc3nc(nc(N4CCOCC4)c3s2)-c2cccc(CO)c2)CC1