Reaction Details
TargetPhosphatidylinositol 4,5-bisphosphate 3-kinase catalytic subunit alpha isoform
LigandBDBM25028
Substrate/Competitorn/a
Meas. Tech.ChEMBL_615563 (CHEMBL1108625)
IC50 3±n/a nM
Citation Sutherlin, DPSampath, DBerry, MCastanedo, GChang, ZChuckowree, IDotson, JFolkes, AFriedman, LGoldsmith, RHeffron, TLee, LLesnick, JLewis, CMathieu, SNonomiya, JOlivero, APang, JPrior, WWSalphati, LSideris, STian, QTsui, VWan, NCWang, SWiesmann, CWong, SZhu, BY Discovery of (thienopyrimidin-2-yl)aminopyrimidines as potent, selective, and orally available pan-PI3-kinase and dual pan-PI3-kinase/mTOR inhibitors for the treatment of cancer. J Med Chem53:1086-97 (2010) 
 
Phosphatidylinositol 4,5-bisphosphate 3-kinase catalytic subunit alpha isoform
Name:Phosphatidylinositol 4,5-bisphosphate 3-kinase catalytic subunit alpha isoform
Type:Enzyme Subunit
Mol. Mass.:124294.87
Organism:Homo sapiens (Human)
Description:P42336
Residue:1068
BDBM25028
NameBDBM25028
Synonyms:4-[2-(1H-indazol-4-yl)-6-[(4-methanesulfonylpiperazin-1-yl)methyl]thieno[3,2-d]pyrimidin-4-yl]morpholine GDC0941 US10851091, Compound pictilisib
TypeSmall organic molecule
Emp. Form.C23H27N7O3S2
Mol. Mass.513.636
SMILESCS(=O)(=O)N1CCN(Cc2cc3nc(nc(N4CCOCC4)c3s2)-c2cccc3[nH]ncc23)CC1