Reaction Details
TargetHistone deacetylase 3
LigandBDBM50312621
Substrate/Competitorn/a
Meas. Tech.ChEMBL_616014 (CHEMBL1101058)
IC50 1.4±n/a nM
Citation He, RChen, YChen, YOugolkov, AVZhang, JSSavoy, DNBilladeau, DDKozikowski, AP Synthesis and biological evaluation of triazol-4-ylphenyl-bearing histone deacetylase inhibitors as anticancer agents. J Med Chem53:1347-56 (2010) 
 
Histone deacetylase 3
Name:Histone deacetylase 3
Type:Enzyme
Mol. Mass.:48829.55
Organism:Homo sapiens (Human)
Description:O15379
Residue:428
BDBM50312621
NameBDBM50312621
Synonyms:CHEMBL1091815 | Octanedioic Acid-{3-[1-(3,5-Difluorophenyl)-1H-[1,2,3]triazol-4-yl]phenyl}amide-Hydroxyamide
TypeSmall organic molecule
Emp. Form.C22H23F2N5O3
Mol. Mass.443.4465
SMILESONC(=O)CCCCCCC(=O)Nc1cccc(c1)-c1cn(nn1)-c1cc(F)cc(F)c1