Reaction Details
TargetHistone deacetylase 3
LigandBDBM50312623
Substrate/Competitorn/a
Meas. Tech.ChEMBL_616014 (CHEMBL1101058)
IC50 3.39±n/a nM
Citation He, RChen, YChen, YOugolkov, AVZhang, JSSavoy, DNBilladeau, DDKozikowski, AP Synthesis and biological evaluation of triazol-4-ylphenyl-bearing histone deacetylase inhibitors as anticancer agents. J Med Chem53:1347-56 (2010) 
 
Histone deacetylase 3
Name:Histone deacetylase 3
Type:Enzyme
Mol. Mass.:48829.55
Organism:Homo sapiens (Human)
Description:O15379
Residue:428
BDBM50312623
NameBDBM50312623
Synonyms:CHEMBL1076939 | Octanedioic Acid-{3-[1-(3-Fluoro-4-methoxyphenyl)-1H-[1,2,3]-triazol-4-yl]phenyl}amide-Hydroxyamide
TypeSmall organic molecule
Emp. Form.C23H26FN5O4
Mol. Mass.455.482
SMILESCOc1cc(ccc1F)-n1cc(nn1)-c1cccc(NC(=O)CCCCCCC(=O)NO)c1