Reaction Details
TargetHistone deacetylase 1
LigandBDBM50312623
Substrate/Competitorn/a
Meas. Tech.ChEMBL_616012 (CHEMBL1101056)
IC50 5.06±n/a nM
Citation He, RChen, YChen, YOugolkov, AVZhang, JSSavoy, DNBilladeau, DDKozikowski, AP Synthesis and biological evaluation of triazol-4-ylphenyl-bearing histone deacetylase inhibitors as anticancer agents. J Med Chem53:1347-56 (2010) 
 
Histone deacetylase 1
Name:Histone deacetylase 1
Type:Enzyme
Mol. Mass.:55090.27
Organism:Homo sapiens (Human)
Description:Q13547
Residue:482
BDBM50312623
NameBDBM50312623
Synonyms:CHEMBL1076939 | Octanedioic Acid-{3-[1-(3-Fluoro-4-methoxyphenyl)-1H-[1,2,3]-triazol-4-yl]phenyl}amide-Hydroxyamide
TypeSmall organic molecule
Emp. Form.C23H26FN5O4
Mol. Mass.455.482
SMILESCOc1cc(ccc1F)-n1cc(nn1)-c1cccc(NC(=O)CCCCCCC(=O)NO)c1