Reaction Details
TargetHistone deacetylase 2
LigandBDBM50312625
Substrate/Competitorn/a
Meas. Tech.ChEMBL_616013 (CHEMBL1101057)
IC50>30000±n/a nM
Citation He, RChen, YChen, YOugolkov, AVZhang, JSSavoy, DNBilladeau, DDKozikowski, AP Synthesis and biological evaluation of triazol-4-ylphenyl-bearing histone deacetylase inhibitors as anticancer agents. J Med Chem53:1347-56 (2010) 
 
Histone deacetylase 2
Name:Histone deacetylase 2
Type:Chromatin regulator; hydrolase; repressor
Mol. Mass.:55356.54
Organism:Homo sapiens (Human)
Description:Q92769
Residue:488
BDBM50312625
NameBDBM50312625
Synonyms:CHEMBL1087053 | N1-(2-aminophenyl)-N8-(3-(4-phenyl-1H-1,2,3-triazol-1-yl)phenyl)octanediamide
TypeSmall organic molecule
Emp. Form.C28H30N6O2
Mol. Mass.482.5768
SMILESNc1ccccc1NC(=O)CCCCCCC(=O)Nc1cccc(c1)-n1cc(nn1)-c1ccccc1