Reaction Details
TargetHistone deacetylase 6
LigandBDBM50312628
Substrate/Competitorn/a
Meas. Tech.ChEMBL_616017 (CHEMBL1101061)
IC50 3.1±n/a nM
Citation He, RChen, YChen, YOugolkov, AVZhang, JSSavoy, DNBilladeau, DDKozikowski, AP Synthesis and biological evaluation of triazol-4-ylphenyl-bearing histone deacetylase inhibitors as anticancer agents. J Med Chem53:1347-56 (2010) 
 
Histone deacetylase 6
Name:Histone deacetylase 6
Type:Chromatin regulator; hydrolase; repressor
Mol. Mass.:131381.51
Organism:Homo sapiens (Human)
Description:Q9UBN7
Residue:1215
BDBM50312628
NameBDBM50312628
Synonyms:CHEMBL1094709 | Octanedioic Acid Hydroxyamide-[3-(4-Phenyl[1,2,3]triazol-1-yl)phenyl]amide
TypeSmall organic molecule
Emp. Form.C22H25N5O3
Mol. Mass.407.4656
SMILESONC(=O)CCCCCCC(=O)Nc1cccc(c1)-n1cc(nn1)-c1ccccc1