Reaction Details
TargetHistone deacetylase 3
LigandBDBM50312630
Substrate/Competitorn/a
Meas. Tech.ChEMBL_616014 (CHEMBL1101058)
IC50 5.3±n/a nM
Citation He, RChen, YChen, YOugolkov, AVZhang, JSSavoy, DNBilladeau, DDKozikowski, AP Synthesis and biological evaluation of triazol-4-ylphenyl-bearing histone deacetylase inhibitors as anticancer agents. J Med Chem53:1347-56 (2010) 
 
Histone deacetylase 3
Name:Histone deacetylase 3
Type:Enzyme
Mol. Mass.:48829.55
Organism:Homo sapiens (Human)
Description:O15379
Residue:428
BDBM50312630
NameBDBM50312630
Synonyms:CHEMBL1094710 | Octanedioic Acid-[3-(4-Cyclohexyl-[1,2,3]triazol-1-yl)phenyl]-amide-Hydroxyamide
TypeSmall organic molecule
Emp. Form.C22H31N5O3
Mol. Mass.413.5132
SMILESONC(=O)CCCCCCC(=O)Nc1cccc(c1)-n1cc(nn1)C1CCCCC1