Reaction Details
TargetHistone deacetylase 2
LigandBDBM50312624
Substrate/Competitorn/a
Meas. Tech.ChEMBL_616013 (CHEMBL1101057)
IC50 24.6±n/a nM
Citation He, RChen, YChen, YOugolkov, AVZhang, JSSavoy, DNBilladeau, DDKozikowski, AP Synthesis and biological evaluation of triazol-4-ylphenyl-bearing histone deacetylase inhibitors as anticancer agents. J Med Chem53:1347-56 (2010) 
 
Histone deacetylase 2
Name:Histone deacetylase 2
Type:Chromatin regulator; hydrolase; repressor
Mol. Mass.:55356.54
Organism:Homo sapiens (Human)
Description:Q92769
Residue:488
BDBM50312624
NameBDBM50312624
Synonyms:CHEMBL1091475 | Octanedioic Acid Hydroxyamide-{3-[1-(4-Iodophenyl)-1H-[1,2,3]triazol-4-yl]phenyl}amide
TypeSmall organic molecule
Emp. Form.C22H24IN5O3
Mol. Mass.533.3621
SMILESONC(=O)CCCCCCC(=O)Nc1cccc(c1)-c1cn(nn1)-c1ccc(I)cc1