Reaction Details
TargetHistone deacetylase 2
LigandBDBM50312626
Substrate/Competitorn/a
Meas. Tech.ChEMBL_616013 (CHEMBL1101057)
IC50 28.5±n/a nM
Citation He, RChen, YChen, YOugolkov, AVZhang, JSSavoy, DNBilladeau, DDKozikowski, AP Synthesis and biological evaluation of triazol-4-ylphenyl-bearing histone deacetylase inhibitors as anticancer agents. J Med Chem53:1347-56 (2010) 
 
Histone deacetylase 2
Name:Histone deacetylase 2
Type:Chromatin regulator; hydrolase; repressor
Mol. Mass.:55356.54
Organism:Homo sapiens (Human)
Description:Q92769
Residue:488
BDBM50312626
NameBDBM50312626
Synonyms:CHEMBL1088734 | Octanedioic Acid Hydroxyamide-{3-[1-(4-Trifluoromethylphenyl)-1H-[1,2,3]triazol-4-yl]phenyl}amide
TypeSmall organic molecule
Emp. Form.C23H24F3N5O3
Mol. Mass.475.4636
SMILESONC(=O)CCCCCCC(=O)Nc1cccc(c1)-c1cn(nn1)-c1ccc(cc1)C(F)(F)F