Reaction Details
TargetPolyamine deacetylase HDAC10
LigandBDBM24351
Substrate/Competitorn/a
Meas. Tech.ChEMBL_616016 (CHEMBL1101060)
IC50 27.7±n/a nM
Citation He, RChen, YChen, YOugolkov, AVZhang, JSSavoy, DNBilladeau, DDKozikowski, AP Synthesis and biological evaluation of triazol-4-ylphenyl-bearing histone deacetylase inhibitors as anticancer agents. J Med Chem53:1347-56 (2010) 
 
Polyamine deacetylase HDAC10
Name:Polyamine deacetylase HDAC10
Type:Chromatin regulator; hydrolase; repressor
Mol. Mass.:71431.89
Organism:Homo sapiens (Human)
Description:Q969S8
Residue:669
BDBM24351
NameBDBM24351
Synonyms:N-hydroxy-N'-[3-(1-phenyl-1H-1,2,3-triazol-4-yl)phenyl]octanediamide | Triazole Ligand, 10c
TypeSmall organic molecule
Emp. Form.C22H25N5O3
Mol. Mass.407.4656
SMILESONC(=O)CCCCCCC(=O)Nc1cccc(c1)-c1cn(nn1)-c1ccccc1