Reaction Details
TargetHistone deacetylase 1
LigandBDBM50312631
Substrate/Competitorn/a
Meas. Tech.ChEMBL_616012 (CHEMBL1101056)
IC50 31.9±n/a nM
Citation He, RChen, YChen, YOugolkov, AVZhang, JSSavoy, DNBilladeau, DDKozikowski, AP Synthesis and biological evaluation of triazol-4-ylphenyl-bearing histone deacetylase inhibitors as anticancer agents. J Med Chem53:1347-56 (2010) 
 
Histone deacetylase 1
Name:Histone deacetylase 1
Type:Enzyme
Mol. Mass.:55090.27
Organism:Homo sapiens (Human)
Description:Q13547
Residue:482
BDBM50312631
NameBDBM50312631
Synonyms:CHEMBL1091474 | Octanedioic Acid-{3-[1-(4-Fluorophenyl)-1H-[1,2,3]triazol-4-yl]phenyl}amide-Hydroxyamide
TypeSmall organic molecule
Emp. Form.C22H24FN5O3
Mol. Mass.425.4561
SMILESONC(=O)CCCCCCC(=O)Nc1cccc(c1)-c1cn(nn1)-c1ccc(F)cc1