Reaction Details
TargetProtein tyrosine phosphatase type IVA 2
LigandBDBM50312665
Substrate/Competitorn/a
Meas. Tech.ChEMBL_614708 (CHEMBL1113393)
IC50 314±n/a nM
Citation Chou, LCChen, CTLee, JCWay, TDHuang, CHHuang, SMTeng, CMYamori, TWu, TSSun, CMChien, DSQian, KMorris-Natschke, SLLee, KHHuang, LJKuo, SC Synthesis and preclinical evaluations of 2-(2-fluorophenyl)-6,7-methylenedioxyquinolin-4-one monosodium phosphate (CHM-1-P-Na) as a potent antitumor agent. J Med Chem53:1616-26 (2010) 
 
Protein tyrosine phosphatase type IVA 2
Name:Protein tyrosine phosphatase type IVA 2
Type:PROTEIN
Mol. Mass.:19133.04
Organism:Homo sapiens (Human)
Description:ChEMBL_1461023
Residue:167
BDBM50312665
NameBDBM50312665
Synonyms:CHEMBL1088572 | Sodium 2-(2-Fluorophenyl)-6,7-methylenedioxyquinolin-4-yl hydrogen phosphate
TypeSmall organic molecule
Emp. Form.C16H12FNO6P
Mol. Mass.364.2423
SMILESOP([O-])(=O)OC1CC(=Nc2cc3OCOc3cc12)c1ccccc1F