Reaction Details
TargetCholesteryl ester transfer protein
LigandBDBM50312720
Substrate/Competitorn/a
Meas. Tech.ChEMBL_615620 (CHEMBL1104194)
IC50 24±n/a nM
Citation Schmeck, CGielen-Haertwig, HVakalopoulos, ABischoff, HLi, VWirtz, GWeber, O Novel tetrahydrochinoline derived CETP inhibitors. Bioorg Med Chem Lett20:1740-3 (2010) 
 
Cholesteryl ester transfer protein
Name:Cholesteryl ester transfer protein
Type:Enzyme
Mol. Mass.:54751.53
Organism:Homo sapiens (Human)
Description:P11597
Residue:493
BDBM50312720
NameBDBM50312720
Synonyms:(S)-3'-((S)-fluoro(4-(trifluoromethyl)phenyl)methyl)-4'-(4-fluorophenyl)-2'-isopropyl-6',8'-dihydro-5'H-spiro[cyclobutane-1,7'-quinolin]-5'-ol CHEMBL1086624
TypeSmall organic molecule
Emp. Form.C29H28F5NO
Mol. Mass.501.5307
SMILESCC(C)c1nc2CC3(CCC3)C[C@H](O)c2c(-c2ccc(F)cc2)c1[C@@H](F)c1ccc(cc1)C(F)(F)F