Reaction Details
TargetD(2) dopamine receptor
LigandBDBM50312778
Substrate/Competitorn/a
Meas. Tech.ChEMBL_615841 (CHEMBL1101951)
Ki>10000±n/a nM
Citation Yu, MLizarzaburu, MBeckmann, HConnors, RDai, KHaller, KLi, CLiang, LLindstrom, MMa, JMotani, AWanska, MZhang, ALi, LMedina, JC Identification of piperazine-bisamide GHSR antagonists for the treatment of obesity. Bioorg Med Chem Lett20:1758-62 (2010) 
 
D(2) dopamine receptor
Name:D(2) dopamine receptor
Type:Cell-surface receptors
Mol. Mass.:50647.10
Organism:Homo sapiens (Human)
Description:P14416
Residue:443
BDBM50312778
NameBDBM50312778
Synonyms:(S)-(4-(1H-indole-6-carbonyl)-3-methylpiperazin-1-yl)(2'-fluorobiphenyl-4-yl)methanone | CHEMBL1080389
TypeSmall organic molecule
Emp. Form.C27H24FN3O2
Mol. Mass.441.4968
SMILESC[C@H]1CN(CCN1C(=O)c1ccc2cc[nH]c2c1)C(=O)c1ccc(cc1)-c1ccccc1F