Reaction Details
TargetSodium-dependent serotonin transporter
LigandBDBM50312772
Substrate/Competitorn/a
Meas. Tech.ChEMBL_615839 (CHEMBL1101949)
Ki>10000±n/a nM
Citation Yu, MLizarzaburu, MBeckmann, HConnors, RDai, KHaller, KLi, CLiang, LLindstrom, MMa, JMotani, AWanska, MZhang, ALi, LMedina, JC Identification of piperazine-bisamide GHSR antagonists for the treatment of obesity. Bioorg Med Chem Lett20:1758-62 (2010) 
 
Sodium-dependent serotonin transporter
Name:Sodium-dependent serotonin transporter
Type:Multi-pass membrane protein
Mol. Mass.:70322.51
Organism:Homo sapiens (Human)
Description:P31645
Residue:630
BDBM50312772
NameBDBM50312772
Synonyms:(R)-(4-(1H-indole-6-carbonyl)-3-methylpiperazin-1-yl)(3'-methoxybiphenyl-4-yl)methanone | CHEMBL1081649
TypeSmall organic molecule
Emp. Form.C28H27N3O3
Mol. Mass.453.5323
SMILESCOc1cccc(c1)-c1ccc(cc1)C(=O)N1CCN([C@H](C)C1)C(=O)c1ccc2cc[nH]c2c1