Reaction Details
TargetSodium-dependent dopamine transporter
LigandBDBM50312766
Substrate/Competitorn/a
Meas. Tech.ChEMBL_615843 (CHEMBL1101953)
Ki>10000±n/a nM
Citation Yu, MLizarzaburu, MBeckmann, HConnors, RDai, KHaller, KLi, CLiang, LLindstrom, MMa, JMotani, AWanska, MZhang, ALi, LMedina, JC Identification of piperazine-bisamide GHSR antagonists for the treatment of obesity. Bioorg Med Chem Lett20:1758-62 (2010) 
 
Sodium-dependent dopamine transporter
Name:Sodium-dependent dopamine transporter
Type:Multi-pass membrane protein
Mol. Mass.:68497.11
Organism:Homo sapiens (Human)
Description:Q01959
Residue:620
BDBM50312766
NameBDBM50312766
Synonyms:(S)-(4-(1H-indole-6-carbonyl)-3-methylpiperazin-1-yl)(2'-methylbiphenyl-4-yl)methanone | CHEMBL1080907
TypeSmall organic molecule
Emp. Form.C28H27N3O2
Mol. Mass.437.5329
SMILESC[C@H]1CN(CCN1C(=O)c1ccc2cc[nH]c2c1)C(=O)c1ccc(cc1)-c1ccccc1C