Reaction Details
TargetKappa-type opioid receptor
LigandBDBM50312770
Substrate/Competitorn/a
Meas. Tech.ChEMBL_615845 (CHEMBL1101955)
Ki>10000±n/a nM
Citation Yu, MLizarzaburu, MBeckmann, HConnors, RDai, KHaller, KLi, CLiang, LLindstrom, MMa, JMotani, AWanska, MZhang, ALi, LMedina, JC Identification of piperazine-bisamide GHSR antagonists for the treatment of obesity. Bioorg Med Chem Lett20:1758-62 (2010) 
 
Kappa-type opioid receptor
Name:Kappa-type opioid receptor
Type:G Protein-Coupled Receptor (GPCR)
Mol. Mass.:42648.76
Organism:Homo sapiens (Human)
Description:P41145
Residue:380
BDBM50312770
NameBDBM50312770
Synonyms:(4-(1H-indole-6-carbonyl)piperazin-1-yl)(biphenyl-4-yl)methanone | CHEMBL1076586
TypeSmall organic molecule
Emp. Form.C26H23N3O2
Mol. Mass.409.4797
SMILESO=C(N1CCN(CC1)C(=O)c1ccc2cc[nH]c2c1)c1ccc(cc1)-c1ccccc1