Reaction Details
TargetCholinesterase
LigandBDBM50004000
Substrate/Competitorn/a
Meas. Tech.ChEMBL_615850 (CHEMBL1101960)
IC50 280±n/a nM
Citation Takahashi, JHijikuro, IKihara, TMurugesh, MGFuse, SKunimoto, RTsumura, YAkaike, ANiidome, TOkuno, YTakahashi, TSugimoto, H Design, synthesis, evaluation and QSAR analysis of N(1)-substituted norcymserine derivatives as selective butyrylcholinesterase inhibitors. Bioorg Med Chem Lett20:1718-20 (2010) 
 
Cholinesterase
Name:Cholinesterase
Type:Protein
Mol. Mass.:68465.99
Organism:Mus musculus (Mouse)
Description:Q03311
Residue:603
BDBM50004000
NameBDBM50004000
Synonyms:(3aS,8aR)-1,3a,8-trimethyl-1,2,3,3a,8,8a-hexahydropyrrolo[2,3-b]indol-5-yl methylcarbamate CHEMBL94 Physostol | physostigmine
TypeSmall organic molecule
Emp. Form.C15H21N3O2
Mol. Mass.275.3461
SMILESCNC(=O)Oc1ccc2N(C)[C@H]3N(C)CC[C@@]3(C)c2c1