Reaction Details
TargetCannabinoid receptor 2
LigandBDBM50312839
Substrate/Competitorn/a
Meas. Tech.ChEMBL_615859 (CHEMBL1101969)
Ki 36±n/a nM
Citation Fujinaga, MKumata, KYanamoto, KKawamura, KYamasaki, TYui, JHatori, AOgawa, MYoshida, YNengaki, NMaeda, JZhang, MR Radiosynthesis of novel carbon-11-labeled triaryl ligands for cannabinoid-type 2 receptor. Bioorg Med Chem Lett20:1565-8 (2010) 
 
Cannabinoid receptor 2
Name:Cannabinoid receptor 2
Type:G Protein-Coupled Receptor (GPCR)
Mol. Mass.:39690.94
Organism:Homo sapiens (Human)
Description:P34972
Residue:360
BDBM50312839
NameBDBM50312839
Synonyms:CHEMBL1081622 | [18F]8-butoxy-N-cyclohexyl-7-(2-fluoroethoxy)-2-oxo-1,2-dihydroquinoline-3-carboxamide
TypeSmall organic molecule
Emp. Form.C22H29FN2O4
Mol. Mass.404.4751
SMILESCCCCOc1c(OCCF)ccc2cc(C(=O)NC3CCCCC3)c(=O)[nH]c12