Reaction Details
TargetCannabinoid receptor 1
LigandBDBM50312841
Substrate/Competitorn/a
Meas. Tech.ChEMBL_615861 (CHEMBL1101971)
Ki 503±n/a nM
Citation Fujinaga, MKumata, KYanamoto, KKawamura, KYamasaki, TYui, JHatori, AOgawa, MYoshida, YNengaki, NMaeda, JZhang, MR Radiosynthesis of novel carbon-11-labeled triaryl ligands for cannabinoid-type 2 receptor. Bioorg Med Chem Lett20:1565-8 (2010) 
 
Cannabinoid receptor 1
Name:Cannabinoid receptor 1
Type:G Protein-Coupled Receptor (GPCR)
Mol. Mass.:52868.96
Organism:Homo sapiens (Human)
Description:P21554
Residue:472
BDBM50312841
NameBDBM50312841
Synonyms:CHEMBL1081609 [11C](3',5'-dichloro-2-hydroxy-6-methoxybiphenyl-4-yl)(thiophen-2-yl)methanone
TypeSmall organic molecule
Emp. Form.C18H12Cl2O3S
Mol. Mass.379.257
SMILESCOc1cc(cc(O)c1-c1cc(Cl)cc(Cl)c1)C(=O)c1cccs1