Reaction Details
TargetCannabinoid receptor 1
LigandBDBM50312840
Substrate/Competitorn/a
Meas. Tech.ChEMBL_615861 (CHEMBL1101971)
Ki>1000±n/a nM
Citation Fujinaga, MKumata, KYanamoto, KKawamura, KYamasaki, TYui, JHatori, AOgawa, MYoshida, YNengaki, NMaeda, JZhang, MR Radiosynthesis of novel carbon-11-labeled triaryl ligands for cannabinoid-type 2 receptor. Bioorg Med Chem Lett20:1565-8 (2010) 
 
Cannabinoid receptor 1
Name:Cannabinoid receptor 1
Type:G Protein-Coupled Receptor (GPCR)
Mol. Mass.:52868.96
Organism:Homo sapiens (Human)
Description:P21554
Residue:472
BDBM50312840
NameBDBM50312840
Synonyms:CHEMBL1076680 [11C](3',5'-dichloro-2,6-dimethoxybiphenyl-4-yl)(thiophen-2-yl)methanol
TypeSmall organic molecule
Emp. Form.C19H16Cl2O3S
Mol. Mass.395.3
SMILESCOc1cc(cc(OC)c1-c1cc(Cl)cc(Cl)c1)C(O)c1cccs1